{"text_format":"1","workbook":"xlsx","n_sheets":5,"sheets":["Kunde","Eingabe Ruocco","CSV","PLZ","Dropdown"],"not_rendered":{"charts":0,"images":0,"macros":0,"external_links":0,"defined_names":0,"comments":1,"pivot_tables":0},"unopened":[],"bounds":{"document_bytes":16777216,"sheet_cells":100000,"rows_first":2000,"rows_last":500,"rows_between":2000,"halvings":0,"cell_chars":16384,"cell_head_chars":4096},"cells_cut":0,"cells_raw":0,"read":"whole","date_system":"1900"}

{"sheet":"Kunde","index":0,"n_rows":201,"n_cols":16,"rows_kept":201,"cut":false,"hidden":false,"merged":[[0,12,1,15],[14,12,15,14],[14,15,15,15],[2,12,13,15]]}
["Anrede","Vorname","Nachname","Firma","Firma Zusatz","Strasse","Nr","PLZ","Ort","Tel","E-Mail",null,"SKS VERSAND BOX • INFOS"]
["Herr","Fritz","Mustermann",null,null,"Haupstrasse",1,3054,{"$f":"IF(ISBLANK(H:H),\"\",VLOOKUP(H:H,Tabelle_PLZ[#All],2,FALSE))","v":"Schüpfen"},"031 123 45 67","fritzmustermann@gmail.com"]
[null,null,null,"Musterfirma",null,"Haupstrasse",1,3054,{"$f":"IF(ISBLANK(H:H),\"\",VLOOKUP(H:H,Tabelle_PLZ[#All],2,FALSE))","v":"Schüpfen"},"031 123 45 67","info@musterfirma.com",null,"Die Personen werden über die eingetragene \nTelefonnummer und Email zur Sendung informiert.\nFalls dies nicht gewünscht ist, bitte mit Daten der zuständigen Person ausfüllen.\n\nNachname oder Firma ist zwingend nötig.\nNach dem Eingeben des Nachnamen oder der Firma erscheinen die benötigten Zellen rot.\nDer Ort wird von der PLZ abgeleitet.\nTel-Nummern nur im Format 031 123 45 67."]
[null,null,null,null,null,null,null,null,{"$f":"IF(ISBLANK(H:H),\"\",VLOOKUP(H:H,Tabelle_PLZ[#All],2,FALSE))","v":""}]
[null,null,null,null,null,null,null,null,{"$f":"IF(ISBLANK(H:H),\"\",VLOOKUP(H:H,Tabelle_PLZ[#All],2,FALSE))","v":""}]
[null,null,null,null,null,null,null,null,{"$f":"IF(ISBLANK(H:H),\"\",VLOOKUP(H:H,Tabelle_PLZ[#All],2,FALSE))","v":""}]
[null,null,null,null,null,null,null,null,{"$f":"IF(ISBLANK(H:H),\"\",VLOOKUP(H:H,Tabelle_PLZ[#All],2,FALSE))","v":""}]
[null,null,null,null,null,null,null,null,{"$f":"IF(ISBLANK(H:H),\"\",VLOOKUP(H:H,Tabelle_PLZ[#All],2,FALSE))","v":""}]
[null,null,null,null,null,null,null,null,{"$f":"IF(ISBLANK(H:H),\"\",VLOOKUP(H:H,Tabelle_PLZ[#All],2,FALSE))","v":""}]
[null,null,null,null,null,null,null,null,{"$f":"IF(ISBLANK(H:H),\"\",VLOOKUP(H:H,Tabelle_PLZ[#All],2,FALSE))","v":""}]
[null,null,null,null,null,null,null,null,{"$f":"IF(ISBLANK(H:H),\"\",VLOOKUP(H:H,Tabelle_PLZ[#All],2,FALSE))","v":""}]
[null,null,null,null,null,null,null,null,{"$f":"IF(ISBLANK(H:H),\"\",VLOOKUP(H:H,Tabelle_PLZ[#All],2,FALSE))","v":""}]
[null,null,null,null,null,null,null,null,{"$f":"IF(ISBLANK(H:H),\"\",VLOOKUP(H:H,Tabelle_PLZ[#All],2,FALSE))","v":""}]
[null,null,null,null,null,null,null,null,{"$f":"IF(ISBLANK(H:H),\"\",VLOOKUP(H:H,Tabelle_PLZ[#All],2,FALSE))","v":""}]
[null,null,null,null,null,null,null,null,{"$f":"IF(ISBLANK(H:H),\"\",VLOOKUP(H:H,Tabelle_PLZ[#All],2,FALSE))","v":""},null,null,null,"ANZAHL BOXEN",null,null,{"$f":"COUNTA(IF(OR(KundenTabelle[Nachname]<>\"\",KundenTabelle[Firma]<>\"\"),KundenTabelle[Nachname]),KundenTabelle[Firma])","v":2}]
{"$rows_left_out":187}
{"sheet":"Eingabe Ruocco","index":1,"n_rows":10,"n_cols":6,"rows_kept":10,"cut":false,"hidden":true,"merged":[[9,1,12,5]]}
[]
[null,"Abholdatum","Lieferdatum","Auftragsnummer (Referenz)","Box","Gewicht (kg)"]
[null,"2023-01-01","2023-01-02",200012345,"Klein",1.5]
[]
[]
[]
[]
[]
[]
[null,"Diese Daten müssen von einem Ruocco/Shop Mitarbeiter eingegeben werden.\nDas Gewicht kann aus dem Abacus Auftrag (oben rechts im O111) entnommen werden."]

{"sheet":"CSV","index":2,"n_rows":330,"n_cols":45,"rows_kept":330,"cut":false,"hidden":true,"merged":[]}
["A1",170880,3,"H","Soulkitchen","Shop","Ruocco Antipasti Manufaktur AG",null,"CH","Schüpfen",3054,"Bernstrasse",22,"Absenderinstruktion","031 872 17 14",null,"info@soulkitchenshop.ch","de",{"$f":"'Eingabe Ruocco'!$B$3","v":"2023-01-01"},{"$f":"IF(ISBLANK(INDIRECT(\"Kunde!A\"&((2+ROW())/3)+1)),\"\",LEFT(INDIRECT(\"Kunde!A\"&((2+ROW())/3)+1)))","v":"H"},{"$f":"IF(ISBLANK(INDIRECT(\"Kunde!B\"&((2+ROW())/3)+1)),\"\",INDIRECT(\"Kunde!B\"&((2+ROW())/3)+1))","v":"Fritz"},{"$f":"IF(ISBLANK(INDIRECT(\"Kunde!C\"&((2+ROW())/3)+1)),\"\",INDIRECT(\"Kunde!C\"&((2+ROW())/3)+1))","v":"Mustermann"},{"$f":"IF(ISBLANK(INDIRECT(\"Kunde!D\"&((2+ROW())/3)+1)),\"\",INDIRECT(\"Kunde!D\"&((2+ROW())/3)+1))","v":""},{"$f":"IF(ISBLANK(INDIRECT(\"Kunde!E\"&((2+ROW())/3)+1)),\"\",INDIRECT(\"Kunde!E\"&((2+ROW())/3)+1))","v":""},{"$f":"IF(OR($V:$V<>\"\", $W:$W<>\"\"),\"CH\",\"\")","v":"CH"},{"$f":"IF(ISBLANK(INDIRECT(\"Kunde!I\"&((2+ROW())/3)+1)),\"\",INDIRECT(\"Kunde!I\"&((2+ROW())/3)+1))","v":"Schüpfen"},{"$f":"IF(ISBLANK(INDIRECT(\"Kunde!H\"&((2+ROW())/3)+1)),\"\",INDIRECT(\"Kunde!H\"&((2+ROW())/3)+1))","v":3054},{"$f":"IF(ISBLANK(INDIRECT(\"Kunde!F\"&((2+ROW())/3)+1)),\"\",INDIRECT(\"Kunde!F\"&((2+ROW())/3)+1))","v":"Haupstrasse"},{"$f":"IF(ISBLANK(INDIRECT(\"Kunde!G\"&((2+ROW())/3)+1)),\"\",INDIRECT(\"Kunde!G\"&((2+ROW())/3)+1))","v":1},null,null,{"$f":"IF(ISBLANK(INDIRECT(\"Kunde!J\"&((2+ROW())/3)+1)),\"\",INDIRECT(\"Kunde!J\"&((2+ROW())/3)+1))","v":"031 123 45 67"},{"$f":"IF(ISBLANK(INDIRECT(\"Kunde!K\"&((2+ROW())/3)+1)),\"\",INDIRECT(\"Kunde!K\"&((2+ROW())/3)+1))","v":"fritzmustermann@gmail.com"},{"$f":"IF(OR($V:$V<>\"\", $W:$W<>\"\"),\"de\",\"\")","v":"de"},{"$f":"IF(OR($V:$V<>\"\", $W:$W<>\"\"),'Eingabe Ruocco'!$C$3,\"\")","v":"2023-01-02"},{"$f":"IF(OR($V:$V<>\"\", $W:$W<>\"\"),'Eingabe Ruocco'!$D$3,\"\")","v":200012345},null,null,null,null,null,{"$f":"IF(OR($V:$V<>\"\", $W:$W<>\"\"),\"Bei Tor 2 abholen\",\"\")","v":"Bei Tor 2 abholen"},"","",""]
[{"$f":"IF((INDEX(A:A,ROW()-1))=\"\",\"\",\"P1\")","v":"P1"},{"$f":"IF((INDEX(B:B,ROW()-1))=\"\",\"\",\"PAKE\")","v":"PAKE"},{"$f":"IF('Eingabe Ruocco'!E3=\"Klein\",36,IF('Eingabe Ruocco'!E3=\"Mittel\",36,IF('Eingabe Ruocco'!E3=\"Gross\",53,\"\")))","v":36},{"$f":"IF('Eingabe Ruocco'!E3=\"Klein\",35,IF('Eingabe Ruocco'!E3=\"Mittel\",35,IF('Eingabe Ruocco'!E3=\"Gross\",36,\"\")))","v":35},{"$f":"IF('Eingabe Ruocco'!E3=\"Klein\",10,IF('Eingabe Ruocco'!E3=\"Mittel\",20,IF('Eingabe Ruocco'!E3=\"Gross\",20,\"\")))","v":10},{"$f":"IF((INDEX(B:B,ROW()-1))=\"\",\"\",'Eingabe Ruocco'!$F$3)","v":1.5},"Nahrungsmittel",{"$f":"IF((INDEX(B:B,ROW()-1))=\"\",\"\",'Eingabe Ruocco'!D3)","v":200012345}]
[{"$f":"IF((INDEX(A:A,ROW()-1))=\"\",\"\",\"O1\")","v":"O1"},{"$f":"IF((INDEX(B:B,ROW()-1))=\"\",\"\",\"DepotAbh\")","v":"DepotAbh"}]
[{"$f":"IF(OR($V:$V<>\"\", $W:$W<>\"\"),\"A1\",\"\")","v":"A1"},{"$f":"IF(OR($V:$V<>\"\", $W:$W<>\"\"),$B$1,\"\")","v":170880},{"$f":"IF(OR($V:$V<>\"\", $W:$W<>\"\"),$C$1,\"\")","v":3},{"$f":"IF(OR($V:$V<>\"\", $W:$W<>\"\"),$D$1,\"\")","v":"H"},{"$f":"IF(OR($V:$V<>\"\", $W:$W<>\"\"),$E$1,\"\")","v":"Soulkitchen"},{"$f":"IF(OR($V:$V<>\"\", $W:$W<>\"\"),$F$1,\"\")","v":"Shop"},{"$f":"IF(OR($V:$V<>\"\", $W:$W<>\"\"),$G$1,\"\")","v":"Ruocco Antipasti Manufaktur AG"},null,{"$f":"IF(OR($V:$V<>\"\", $W:$W<>\"\"),$I$1,\"\")","v":"CH"},{"$f":"IF(OR($V:$V<>\"\", $W:$W<>\"\"),$J$1,\"\")","v":"Schüpfen"},{"$f":"IF(OR($V:$V<>\"\", $W:$W<>\"\"),$K$1,\"\")","v":3054},{"$f":"IF(OR($V:$V<>\"\", $W:$W<>\"\"),$L$1,\"\")","v":"Bernstrasse"},{"$f":"IF(OR($V:$V<>\"\", $W:$W<>\"\"),$M$1,\"\")","v":22},{"$f":"IF(OR($V:$V<>\"\", $W:$W<>\"\"),$N$1,\"\")","v":"Absenderinstruktion"},{"$f":"IF(OR($V:$V<>\"\", $W:$W<>\"\"),$O$1,\"\")","v":"031 872 17 14"},null,{"$f":"IF(OR($V:$V<>\"\", $W:$W<>\"\"),$Q$1,\"\")","v":"info@soulkitchenshop.ch"},{"$f":"IF(OR($V:$V<>\"\", $W:$W<>\"\"),$R$1,\"\")","v":"de"},{"$f":"IF(OR($V:$V<>\"\", $W:$W<>\"\"),'Eingabe Ruocco'!$B$3,\"\")","v":"2023-01-01"},{"$f":"IF(ISBLANK(INDIRECT(\"Kunde!A\"&((2+ROW())/3)+1)),\"\",LEFT(INDIRECT(\"Kunde!A\"&((2+ROW())/3)+1)))","v":""},{"$f":"IF(ISBLANK(INDIRECT(\"Kunde!B\"&((2+ROW())/3)+1)),\"\",INDIRECT(\"Kunde!B\"&((2+ROW())/3)+1))","v":""},{"$f":"IF(ISBLANK(INDIRECT(\"Kunde!C\"&((2+ROW())/3)+1)),\"\",INDIRECT(\"Kunde!C\"&((2+ROW())/3)+1))","v":""},{"$f":"IF(ISBLANK(INDIRECT(\"Kunde!D\"&((2+ROW())/3)+1)),\"\",INDIRECT(\"Kunde!D\"&((2+ROW())/3)+1))","v":"Musterfirma"},{"$f":"IF(ISBLANK(INDIRECT(\"Kunde!E\"&((2+ROW())/3)+1)),\"\",INDIRECT(\"Kunde!E\"&((2+ROW())/3)+1))","v":""},{"$f":"IF(OR($V:$V<>\"\", $W:$W<>\"\"),\"CH\",\"\")","v":"CH"},{"$f":"IF(ISBLANK(INDIRECT(\"Kunde!I\"&((2+ROW())/3)+1)),\"\",INDIRECT(\"Kunde!I\"&((2+ROW())/3)+1))","v":"Schüpfen"},{"$f":"IF(ISBLANK(INDIRECT(\"Kunde!H\"&((2+ROW())/3)+1)),\"\",INDIRECT(\"Kunde!H\"&((2+ROW())/3)+1))","v":3054},{"$f":"IF(ISBLANK(INDIRECT(\"Kunde!F\"&((2+ROW())/3)+1)),\"\",INDIRECT(\"Kunde!F\"&((2+ROW())/3)+1))","v":"Haupstrasse"},{"$f":"IF(ISBLANK(INDIRECT(\"Kunde!G\"&((2+ROW())/3)+1)),\"\",INDIRECT(\"Kunde!G\"&((2+ROW())/3)+1))","v":1},null,null,{"$f":"IF(ISBLANK(INDIRECT(\"Kunde!J\"&((2+ROW())/3)+1)),\"\",INDIRECT(\"Kunde!J\"&((2+ROW())/3)+1))","v":"031 123 45 67"},{"$f":"IF(ISBLANK(INDIRECT(\"Kunde!K\"&((2+ROW())/3)+1)),\"\",INDIRECT(\"Kunde!K\"&((2+ROW())/3)+1))","v":"info@musterfirma.com"},{"$f":"IF(OR($V:$V<>\"\", $W:$W<>\"\"),\"de\",\"\")","v":"de"},{"$f":"IF(OR($V:$V<>\"\", $W:$W<>\"\"),'Eingabe Ruocco'!$C$3,\"\")","v":"2023-01-02"},{"$f":"IF(OR($V:$V<>\"\", $W:$W<>\"\"),'Eingabe Ruocco'!$D$3,\"\")","v":200012345},null,null,null,null,null,{"$f":"IF(OR($V:$V<>\"\", $W:$W<>\"\"),\"Bei Tor 2 abholen\",\"\")","v":"Bei Tor 2 abholen"}]
[{"$f":"IF((INDEX(A:A,ROW()-1))=\"\",\"\",\"P1\")","v":"P1"},{"$f":"IF((INDEX(B:B,ROW()-1))=\"\",\"\",\"PAKE\")","v":"PAKE"},{"$f":"IF((INDEX(B:B,ROW()-1))=\"\",\"\",$C$2)","v":36},{"$f":"IF((INDEX(B:B,ROW()-1))=\"\",\"\",$D$2)","v":35},{"$f":"IF((INDEX(B:B,ROW()-1))=\"\",\"\",$E$2)","v":10},{"$f":"IF((INDEX(B:B,ROW()-1))=\"\",\"\",$F$2)","v":1.5},{"$f":"IF((INDEX(B:B,ROW()-1))=\"\",\"\",$G$2)","v":"Nahrungsmittel"},{"$f":"IF((INDEX(B:B,ROW()-1))=\"\",\"\",$H$2)","v":200012345}]
[{"$f":"IF((INDEX(A:A,ROW()-1))=\"\",\"\",\"O1\")","v":"O1"},{"$f":"IF((INDEX(B:B,ROW()-1))=\"\",\"\",\"DepotAbh\")","v":"DepotAbh"}]
[{"$f":"IF(OR($V:$V<>\"\", $W:$W<>\"\"),\"A1\",\"\")","v":""},{"$f":"IF(OR($V:$V<>\"\", $W:$W<>\"\"),$B$1,\"\")","v":""},{"$f":"IF(OR($V:$V<>\"\", $W:$W<>\"\"),$C$1,\"\")","v":""},{"$f":"IF(OR($V:$V<>\"\", $W:$W<>\"\"),$D$1,\"\")","v":""},{"$f":"IF(OR($V:$V<>\"\", $W:$W<>\"\"),$E$1,\"\")","v":""},{"$f":"IF(OR($V:$V<>\"\", $W:$W<>\"\"),$F$1,\"\")","v":""},{"$f":"IF(OR($V:$V<>\"\", $W:$W<>\"\"),$G$1,\"\")","v":""},null,{"$f":"IF(OR($V:$V<>\"\", $W:$W<>\"\"),$I$1,\"\")","v":""},{"$f":"IF(OR($V:$V<>\"\", $W:$W<>\"\"),$J$1,\"\")","v":""},{"$f":"IF(OR($V:$V<>\"\", $W:$W<>\"\"),$K$1,\"\")","v":""},{"$f":"IF(OR($V:$V<>\"\", $W:$W<>\"\"),$L$1,\"\")","v":""},{"$f":"IF(OR($V:$V<>\"\", $W:$W<>\"\"),$M$1,\"\")","v":""},{"$f":"IF(OR($V:$V<>\"\", $W:$W<>\"\"),$N$1,\"\")","v":""},{"$f":"IF(OR($V:$V<>\"\", $W:$W<>\"\"),$O$1,\"\")","v":""},null,{"$f":"IF(OR($V:$V<>\"\", $W:$W<>\"\"),$Q$1,\"\")","v":""},{"$f":"IF(OR($V:$V<>\"\", $W:$W<>\"\"),$R$1,\"\")","v":""},{"$f":"IF(OR($V:$V<>\"\", $W:$W<>\"\"),'Eingabe Ruocco'!$B$3,\"\")","v":""},{"$f":"IF(ISBLANK(INDIRECT(\"Kunde!A\"&((2+ROW())/3)+1)),\"\",LEFT(INDIRECT(\"Kunde!A\"&((2+ROW())/3)+1)))","v":""},{"$f":"IF(ISBLANK(INDIRECT(\"Kunde!B\"&((2+ROW())/3)+1)),\"\",INDIRECT(\"Kunde!B\"&((2+ROW())/3)+1))","v":""},{"$f":"IF(ISBLANK(INDIRECT(\"Kunde!C\"&((2+ROW())/3)+1)),\"\",INDIRECT(\"Kunde!C\"&((2+ROW())/3)+1))","v":""},{"$f":"IF(ISBLANK(INDIRECT(\"Kunde!D\"&((2+ROW())/3)+1)),\"\",INDIRECT(\"Kunde!D\"&((2+ROW())/3)+1))","v":""},{"$f":"IF(ISBLANK(INDIRECT(\"Kunde!E\"&((2+ROW())/3)+1)),\"\",INDIRECT(\"Kunde!E\"&((2+ROW())/3)+1))","v":""},{"$f":"IF(OR($V:$V<>\"\", $W:$W<>\"\"),\"CH\",\"\")","v":""},{"$f":"IF(ISBLANK(INDIRECT(\"Kunde!I\"&((2+ROW())/3)+1)),\"\",INDIRECT(\"Kunde!I\"&((2+ROW())/3)+1))","v":""},{"$f":"IF(ISBLANK(INDIRECT(\"Kunde!H\"&((2+ROW())/3)+1)),\"\",INDIRECT(\"Kunde!H\"&((2+ROW())/3)+1))","v":""},{"$f":"IF(ISBLANK(INDIRECT(\"Kunde!F\"&((2+ROW())/3)+1)),\"\",INDIRECT(\"Kunde!F\"&((2+ROW())/3)+1))","v":""},{"$f":"IF(ISBLANK(INDIRECT(\"Kunde!G\"&((2+ROW())/3)+1)),\"\",INDIRECT(\"Kunde!G\"&((2+ROW())/3)+1))","v":""},null,null,{"$f":"IF(ISBLANK(INDIRECT(\"Kunde!J\"&((2+ROW())/3)+1)),\"\",INDIRECT(\"Kunde!J\"&((2+ROW())/3)+1))","v":""},{"$f":"IF(ISBLANK(INDIRECT(\"Kunde!K\"&((2+ROW())/3)+1)),\"\",INDIRECT(\"Kunde!K\"&((2+ROW())/3)+1))","v":""},{"$f":"IF(OR($V:$V<>\"\", $W:$W<>\"\"),\"de\",\"\")","v":""},{"$f":"IF(OR($V:$V<>\"\", $W:$W<>\"\"),'Eingabe Ruocco'!$C$3,\"\")","v":""},{"$f":"IF(OR($V:$V<>\"\", $W:$W<>\"\"),'Eingabe Ruocco'!$D$3,\"\")","v":""},null,null,null,null,null,{"$f":"IF(OR($V:$V<>\"\", $W:$W<>\"\"),\"Bei Tor 2 abholen\",\"\")","v":""}]
[{"$f":"IF((INDEX(A:A,ROW()-1))=\"\",\"\",\"P1\")","v":""},{"$f":"IF((INDEX(B:B,ROW()-1))=\"\",\"\",\"PAKE\")","v":""},{"$f":"IF((INDEX(B:B,ROW()-1))=\"\",\"\",$C$2)","v":""},{"$f":"IF((INDEX(B:B,ROW()-1))=\"\",\"\",$D$2)","v":""},{"$f":"IF((INDEX(B:B,ROW()-1))=\"\",\"\",$E$2)","v":""},{"$f":"IF((INDEX(B:B,ROW()-1))=\"\",\"\",$F$2)","v":""},{"$f":"IF((INDEX(B:B,ROW()-1))=\"\",\"\",$G$2)","v":""},{"$f":"IF((INDEX(B:B,ROW()-1))=\"\",\"\",$H$2)","v":""}]
[{"$f":"IF((INDEX(A:A,ROW()-1))=\"\",\"\",\"O1\")","v":""},{"$f":"IF((INDEX(B:B,ROW()-1))=\"\",\"\",\"DepotAbh\")","v":""}]
[{"$f":"IF(OR($V:$V<>\"\", $W:$W<>\"\"),\"A1\",\"\")","v":""},{"$f":"IF(OR($V:$V<>\"\", $W:$W<>\"\"),$B$1,\"\")","v":""},{"$f":"IF(OR($V:$V<>\"\", $W:$W<>\"\"),$C$1,\"\")","v":""},{"$f":"IF(OR($V:$V<>\"\", $W:$W<>\"\"),$D$1,\"\")","v":""},{"$f":"IF(OR($V:$V<>\"\", $W:$W<>\"\"),$E$1,\"\")","v":""},{"$f":"IF(OR($V:$V<>\"\", $W:$W<>\"\"),$F$1,\"\")","v":""},{"$f":"IF(OR($V:$V<>\"\", $W:$W<>\"\"),$G$1,\"\")","v":""},null,{"$f":"IF(OR($V:$V<>\"\", $W:$W<>\"\"),$I$1,\"\")","v":""},{"$f":"IF(OR($V:$V<>\"\", $W:$W<>\"\"),$J$1,\"\")","v":""},{"$f":"IF(OR($V:$V<>\"\", $W:$W<>\"\"),$K$1,\"\")","v":""},{"$f":"IF(OR($V:$V<>\"\", $W:$W<>\"\"),$L$1,\"\")","v":""},{"$f":"IF(OR($V:$V<>\"\", $W:$W<>\"\"),$M$1,\"\")","v":""},{"$f":"IF(OR($V:$V<>\"\", $W:$W<>\"\"),$N$1,\"\")","v":""},{"$f":"IF(OR($V:$V<>\"\", $W:$W<>\"\"),$O$1,\"\")","v":""},null,{"$f":"IF(OR($V:$V<>\"\", $W:$W<>\"\"),$Q$1,\"\")","v":""},{"$f":"IF(OR($V:$V<>\"\", $W:$W<>\"\"),$R$1,\"\")","v":""},{"$f":"IF(OR($V:$V<>\"\", $W:$W<>\"\"),'Eingabe Ruocco'!$B$3,\"\")","v":""},{"$f":"IF(ISBLANK(INDIRECT(\"Kunde!A\"&((2+ROW())/3)+1)),\"\",LEFT(INDIRECT(\"Kunde!A\"&((2+ROW())/3)+1)))","v":""},{"$f":"IF(ISBLANK(INDIRECT(\"Kunde!B\"&((2+ROW())/3)+1)),\"\",INDIRECT(\"Kunde!B\"&((2+ROW())/3)+1))","v":""},{"$f":"IF(ISBLANK(INDIRECT(\"Kunde!C\"&((2+ROW())/3)+1)),\"\",INDIRECT(\"Kunde!C\"&((2+ROW())/3)+1))","v":""},{"$f":"IF(ISBLANK(INDIRECT(\"Kunde!D\"&((2+ROW())/3)+1)),\"\",INDIRECT(\"Kunde!D\"&((2+ROW())/3)+1))","v":""},{"$f":"IF(ISBLANK(INDIRECT(\"Kunde!E\"&((2+ROW())/3)+1)),\"\",INDIRECT(\"Kunde!E\"&((2+ROW())/3)+1))","v":""},{"$f":"IF(OR($V:$V<>\"\", $W:$W<>\"\"),\"CH\",\"\")","v":""},{"$f":"IF(ISBLANK(INDIRECT(\"Kunde!I\"&((2+ROW())/3)+1)),\"\",INDIRECT(\"Kunde!I\"&((2+ROW())/3)+1))","v":""},{"$f":"IF(ISBLANK(INDIRECT(\"Kunde!H\"&((2+ROW())/3)+1)),\"\",INDIRECT(\"Kunde!H\"&((2+ROW())/3)+1))","v":""},{"$f":"IF(ISBLANK(INDIRECT(\"Kunde!F\"&((2+ROW())/3)+1)),\"\",INDIRECT(\"Kunde!F\"&((2+ROW())/3)+1))","v":""},{"$f":"IF(ISBLANK(INDIRECT(\"Kunde!G\"&((2+ROW())/3)+1)),\"\",INDIRECT(\"Kunde!G\"&((2+ROW())/3)+1))","v":""},null,null,{"$f":"IF(ISBLANK(INDIRECT(\"Kunde!J\"&((2+ROW())/3)+1)),\"\",INDIRECT(\"Kunde!J\"&((2+ROW())/3)+1))","v":""},{"$f":"IF(ISBLANK(INDIRECT(\"Kunde!K\"&((2+ROW())/3)+1)),\"\",INDIRECT(\"Kunde!K\"&((2+ROW())/3)+1))","v":""},{"$f":"IF(OR($V:$V<>\"\", $W:$W<>\"\"),\"de\",\"\")","v":""},{"$f":"IF(OR($V:$V<>\"\", $W:$W<>\"\"),'Eingabe Ruocco'!$C$3,\"\")","v":""},{"$f":"IF(OR($V:$V<>\"\", $W:$W<>\"\"),'Eingabe Ruocco'!$D$3,\"\")","v":""},null,null,null,null,null,{"$f":"IF(OR($V:$V<>\"\", $W:$W<>\"\"),\"Bei Tor 2 abholen\",\"\")","v":""}]
[{"$f":"IF((INDEX(A:A,ROW()-1))=\"\",\"\",\"P1\")","v":""},{"$f":"IF((INDEX(B:B,ROW()-1))=\"\",\"\",\"PAKE\")","v":""},{"$f":"IF((INDEX(B:B,ROW()-1))=\"\",\"\",$C$2)","v":""},{"$f":"IF((INDEX(B:B,ROW()-1))=\"\",\"\",$D$2)","v":""},{"$f":"IF((INDEX(B:B,ROW()-1))=\"\",\"\",$E$2)","v":""},{"$f":"IF((INDEX(B:B,ROW()-1))=\"\",\"\",$F$2)","v":""},{"$f":"IF((INDEX(B:B,ROW()-1))=\"\",\"\",$G$2)","v":""},{"$f":"IF((INDEX(B:B,ROW()-1))=\"\",\"\",$H$2)","v":""}]
[{"$f":"IF((INDEX(A:A,ROW()-1))=\"\",\"\",\"O1\")","v":""},{"$f":"IF((INDEX(B:B,ROW()-1))=\"\",\"\",\"DepotAbh\")","v":""}]
[{"$f":"IF(OR($V:$V<>\"\", $W:$W<>\"\"),\"A1\",\"\")","v":""},{"$f":"IF(OR($V:$V<>\"\", $W:$W<>\"\"),$B$1,\"\")","v":""},{"$f":"IF(OR($V:$V<>\"\", $W:$W<>\"\"),$C$1,\"\")","v":""},{"$f":"IF(OR($V:$V<>\"\", $W:$W<>\"\"),$D$1,\"\")","v":""},{"$f":"IF(OR($V:$V<>\"\", $W:$W<>\"\"),$E$1,\"\")","v":""},{"$f":"IF(OR($V:$V<>\"\", $W:$W<>\"\"),$F$1,\"\")","v":""},{"$f":"IF(OR($V:$V<>\"\", $W:$W<>\"\"),$G$1,\"\")","v":""},null,{"$f":"IF(OR($V:$V<>\"\", $W:$W<>\"\"),$I$1,\"\")","v":""},{"$f":"IF(OR($V:$V<>\"\", $W:$W<>\"\"),$J$1,\"\")","v":""},{"$f":"IF(OR($V:$V<>\"\", $W:$W<>\"\"),$K$1,\"\")","v":""},{"$f":"IF(OR($V:$V<>\"\", $W:$W<>\"\"),$L$1,\"\")","v":""},{"$f":"IF(OR($V:$V<>\"\", $W:$W<>\"\"),$M$1,\"\")","v":""},{"$f":"IF(OR($V:$V<>\"\", $W:$W<>\"\"),$N$1,\"\")","v":""},{"$f":"IF(OR($V:$V<>\"\", $W:$W<>\"\"),$O$1,\"\")","v":""},null,{"$f":"IF(OR($V:$V<>\"\", $W:$W<>\"\"),$Q$1,\"\")","v":""},{"$f":"IF(OR($V:$V<>\"\", $W:$W<>\"\"),$R$1,\"\")","v":""},{"$f":"IF(OR($V:$V<>\"\", $W:$W<>\"\"),'Eingabe Ruocco'!$B$3,\"\")","v":""},{"$f":"IF(ISBLANK(INDIRECT(\"Kunde!A\"&((2+ROW())/3)+1)),\"\",LEFT(INDIRECT(\"Kunde!A\"&((2+ROW())/3)+1)))","v":""},{"$f":"IF(ISBLANK(INDIRECT(\"Kunde!B\"&((2+ROW())/3)+1)),\"\",INDIRECT(\"Kunde!B\"&((2+ROW())/3)+1))","v":""},{"$f":"IF(ISBLANK(INDIRECT(\"Kunde!C\"&((2+ROW())/3)+1)),\"\",INDIRECT(\"Kunde!C\"&((2+ROW())/3)+1))","v":""},{"$f":"IF(ISBLANK(INDIRECT(\"Kunde!D\"&((2+ROW())/3)+1)),\"\",INDIRECT(\"Kunde!D\"&((2+ROW())/3)+1))","v":""},{"$f":"IF(ISBLANK(INDIRECT(\"Kunde!E\"&((2+ROW())/3)+1)),\"\",INDIRECT(\"Kunde!E\"&((2+ROW())/3)+1))","v":""},{"$f":"IF(OR($V:$V<>\"\", $W:$W<>\"\"),\"CH\",\"\")","v":""},{"$f":"IF(ISBLANK(INDIRECT(\"Kunde!I\"&((2+ROW())/3)+1)),\"\",INDIRECT(\"Kunde!I\"&((2+ROW())/3)+1))","v":""},{"$f":"IF(ISBLANK(INDIRECT(\"Kunde!H\"&((2+ROW())/3)+1)),\"\",INDIRECT(\"Kunde!H\"&((2+ROW())/3)+1))","v":""},{"$f":"IF(ISBLANK(INDIRECT(\"Kunde!F\"&((2+ROW())/3)+1)),\"\",INDIRECT(\"Kunde!F\"&((2+ROW())/3)+1))","v":""},{"$f":"IF(ISBLANK(INDIRECT(\"Kunde!G\"&((2+ROW())/3)+1)),\"\",INDIRECT(\"Kunde!G\"&((2+ROW())/3)+1))","v":""},null,null,{"$f":"IF(ISBLANK(INDIRECT(\"Kunde!J\"&((2+ROW())/3)+1)),\"\",INDIRECT(\"Kunde!J\"&((2+ROW())/3)+1))","v":""},{"$f":"IF(ISBLANK(INDIRECT(\"Kunde!K\"&((2+ROW())/3)+1)),\"\",INDIRECT(\"Kunde!K\"&((2+ROW())/3)+1))","v":""},{"$f":"IF(OR($V:$V<>\"\", $W:$W<>\"\"),\"de\",\"\")","v":""},{"$f":"IF(OR($V:$V<>\"\", $W:$W<>\"\"),'Eingabe Ruocco'!$C$3,\"\")","v":""},{"$f":"IF(OR($V:$V<>\"\", $W:$W<>\"\"),'Eingabe Ruocco'!$D$3,\"\")","v":""},null,null,null,null,null,{"$f":"IF(OR($V:$V<>\"\", $W:$W<>\"\"),\"Bei Tor 2 abholen\",\"\")","v":""}]
[{"$f":"IF((INDEX(A:A,ROW()-1))=\"\",\"\",\"P1\")","v":""},{"$f":"IF((INDEX(B:B,ROW()-1))=\"\",\"\",\"PAKE\")","v":""},{"$f":"IF((INDEX(B:B,ROW()-1))=\"\",\"\",$C$2)","v":""},{"$f":"IF((INDEX(B:B,ROW()-1))=\"\",\"\",$D$2)","v":""},{"$f":"IF((INDEX(B:B,ROW()-1))=\"\",\"\",$E$2)","v":""},{"$f":"IF((INDEX(B:B,ROW()-1))=\"\",\"\",$F$2)","v":""},{"$f":"IF((INDEX(B:B,ROW()-1))=\"\",\"\",$G$2)","v":""},{"$f":"IF((INDEX(B:B,ROW()-1))=\"\",\"\",$H$2)","v":""}]
[{"$f":"IF((INDEX(A:A,ROW()-1))=\"\",\"\",\"O1\")","v":""},{"$f":"IF((INDEX(B:B,ROW()-1))=\"\",\"\",\"DepotAbh\")","v":""}]
{"$rows_left_out":316}
{"sheet":"PLZ","index":3,"n_rows":4553,"n_cols":2,"rows_kept":4553,"cut":false,"hidden":true,"merged":[]}
["Spalte1","Spalte2"]
[1000,"Lausanne"]
[1000,"Lausanne 3"]
[1000,"Lausanne 7"]
[1000,"Lausanne 8"]
[1000,"Lausanne 10"]
[1000,"Lausanne 12"]
[1000,"Lausanne 14"]
[1000,"Lausanne 16"]
[1000,"Lausanne 18"]
[1000,"Lausanne 20"]
[1000,"Lausanne 21"]
[1000,"Lausanne 22"]
[1000,"Lausanne 23"]
[1000,"Lausanne 25"]
{"$rows_left_out":4539}
{"sheet":"Dropdown","index":4,"n_rows":4,"n_cols":4,"rows_kept":4,"cut":false,"hidden":true,"merged":[]}
[null,"Anrede",null,"Box"]
[null,"Herr",null,"Klein"]
[null,"Frau",null,"Mittel"]
[null,null,null,"Gross"]